{"text_format":"3","workbook":"xlsx","n_sheets":8,"sheets":["IA MARKS ENTRY & CO attainment","C-Sec","Sheet1","Sheet2","Assignment","final exam","Total CO","Sheet4"],"not_rendered":{"charts":2},"read":"whole","date_system":"1900"}

{"sheet":"IA MARKS ENTRY & CO attainment","index":0,"n_rows":128,"n_cols":18,"rows_kept":128,"merged":[[0,1,0,11],[1,1,1,11],[2,2,2,10],[3,1,3,11],[4,0,7,0],[4,1,7,1],[4,2,7,2],[4,3,5,4],[4,5,5,5],[4,6,5,7],[4,8,6,17],[7,8,7,9],[7,10,7,11],[7,12,7,13],[7,14,7,15],[7,16,7,17],[8,12,8,13],[8,14,8,15],[8,16,8,17],[127,8,127,9]]}
[null,"Sapthagiri College of Engineering"]
[null,"Department of Electronics and Communication Engineering"]
[null,null,"Basic Electronics (15ELN15) G and H sections"]
[null,"II Semester Test marks for EVEN Sem 2015-16"]
["Sl. No.","USN","NAME","I Internal",null,"II Internals","III IA",null,"Course Objectives"]
[]
[]
[{"$nulls":3},"CO 1","CO2","CO3","CO4","C","CO1",null,"CO2",null,"CO3",null,"CO 4",null,"C0 5"]
[null,null,"MAX MARKS",20,20,20,20,20]
[{"$nulls":8},"%",null,"%",null,"%",null,"%",null,"%"]
[1,"1SG15EC001","ABHIJITH N",17,17,13,0,{"$f":"G11","v":0},{"$f":"D11/0.2","v":85},{"$f":"IF(I11<60,\"N\",\"Y\")","v":"Y"},{"$f":"E11/0.2","v":85},{"$f":"IF(K11<60,\"N\",\"Y\")","v":"Y"},{"$f":"((F11)/0.2)","v":65},{"$f":"IF(M11<60,\"N\",\"Y\")","v":"Y"},{"$f":"(G11/0.2)","v":0},{"$f":"IF(O11<60,\"N\",\"Y\")","v":"N"},{"$f":"(H11/0.2)","v":0},"N"]
[2,"1SG15EC002","ABHISHEK K",14,14,15,0,{"$f":"G12","v":0},{"$f":"D12/0.2","v":70},"Y",{"$f":"E12/0.2","v":70},"Y",{"$f":"((F12)/0.2)","v":75},"Y",{"$f":"(G12/0.2)","v":0},{"$f":"IF(O12<60,\"N\",\"Y\")","v":"N"},{"$f":"(H12/0.2)","v":0},{"$f":"IF(Q12<60,\"N\",\"Y\")","v":"N"}]
[3,"1SG15EC003","ABHISHEK N",3,3,13,1,1,15,"N",15,"N",65,"Y",5,"N",5,"N"]
[4,"1SG15EC004","ADITYA P THAKKER",0,0,14,5,5,0,"N",0,"N",70,"Y",25,"N",25,"N"]
[5,"1SG15EC006","AISHWARYA G",17,17,18,0,0,85,"Y",85,"Y",90,"Y",0,"N",0,"N"]
[6,"1SG15EC007","AKHIL SINGH",0,0,10,9,9,0,"N",0,"N",50,"N",45,"N",45,"N"]
[7,"1SG15EC008","ANJALI V JAKATI",16,16,19,0,0,80,"Y",80,"Y",95,"Y",0,"N",0,"N"]
[8,"1SG15EC009","ANJAN O",8,8,15,14,14,40,"N",40,"N",75,"Y",70,"Y",70,"Y"]
[9,"1SG15EC010","ANKIT PRIYAM",10,10,13,4,4,50,"N",50,"N",65,"Y",20,"N",20,"N"]
[10,"1SG15EC011","ANKIT SHIVHARE",12,12,17,15,15,60,"Y",60,"Y",85,"Y",75,"Y",75,"Y"]
[11,"1SG15EC012","ANN NILEENA HENRY C",19,19,18,0,0,95,"Y",95,"Y",90,"Y",0,"N",0,"N"]
[12,"1SG15EC013","ANU PRIYE",12,12,16,0,0,60,"Y",60,"Y",80,"Y",0,"N",0,"N"]
[13,"1SG15EC014","APOORVA G A",15,15,15,0,0,75,"Y",75,"Y",75,"Y",0,"N",0,"N"]
[14,"1SG15EC015","ARCHANA B S",7,7,18,10,10,35,"N",35,"N",90,"Y",50,"N",50,"N"]
[15,"1SG15EC016","ASHWANI GUPTA",5,5,14,9,9,25,"N",25,"N",70,"Y",45,"N",45,"N"]
[16,"1SG15EC017","ASHWIN V",0,0,6,10,10,0,"N",0,"N",30,"N",50,"N",50,"N"]
[17,"1SG15EC018","B NIKHILESHWAR REDDY",15,15,17,0,0,75,"Y",75,"Y",85,"Y",0,"N",0,"N"]
[18,"1SG15EC019","BHAVYA R",12,12,16,12,12,60,"Y",60,"Y",80,"Y",60,"Y",60,"Y"]
[19,"1SG15EC020","BHOOMIKA J",16,16,14,17,17,80,"Y",80,"Y",70,"Y",85,"Y",85,"Y"]
[20,"1SG15EC021","BINDU B",11,11,14,13,13,55,"N",55,"N",70,"Y",65,"Y",65,"Y"]
[21,"1SG15EC022","BIPUL KUMAR",7,7,11,14,14,35,"N",35,"N",55,"N",70,"Y",70,"Y"]
[22,"1SG15EC023","C S ADITH KIRAN",16,16,19,6,6,80,"Y",80,"Y",95,"Y",30,"N",30,"N"]
[23,"1SG15EC024","CHANDANA D L",18,18,19,0,0,90,"Y",90,"Y",95,"Y",0,"N",0,"N"]
[24,"1SG15EC025","CHANNA BASAVA",14,14,16,0,0,70,"Y",70,"Y",80,"Y",0,"N",0,"N"]
[25,"1SG15EC026","CHARITHA B M",12,{"$f":"D35","v":12},15,18,18,60,"Y",60,"Y",75,"Y",90,"Y",90,"Y"]
[26,"1SG15EC027","CHIRAG S",5,{"$f":"D36","v":5},15,17,17,25,"N",25,"N",75,"Y",85,"Y",85,"Y"]
[27,"1SG15EC028","CHITHRA K",18,18,20,0,0,90,"Y",90,"Y",100,"Y",0,"N",0,"N"]
[28,"1SG15EC029","DARSHAN C",6,6,7,7,7,30,"N",30,"N",35,"N",35,"N",35,"N"]
[29,"1SG15EC030","DHARMKIRTI KUMAR",0,0,9,0,0,0,"N",0,"N",45,"N",0,"N",0,"N"]
[30,"1SG15EC031","DILIP V",4,4,5,6,6,20,"N",20,{"$f":"IF(K40<60,\"N\",\"Y\")","v":"N"},25,"N",30,"N",30,"N"]
[31,"1SG15EC032","DIVYA B",15,15,19,19,19,75,"Y",75,{"$f":"IF(K41<60,\"N\",\"Y\")","v":"Y"},95,"Y",95,"Y",95,"Y"]
[32,"1SG15EC033","DIVYA R",15,15,15,20,20,75,"Y",75,"Y",75,"Y",100,"Y",100,"Y"]
[33,"1SG15EC034","GEETHA M",14,14,13,16,16,70,{"$f":"IF(I43<60,\"N\",\"Y\")","v":"Y"},70,"Y",65,"Y",80,"Y",80,"Y"]
[34,"1SG15EC035","GIRISH S",16,16,0,16,16,80,"Y",80,"Y",0,"N",80,"Y",80,"Y"]
[35,"1SG15EC036","GOUTHAM M",9,9,14,13,13,45,"N",45,"N",70,"Y",65,"Y",65,"Y"]
[36,"1SG15EC037","HARISH C",18,18,19,0,0,90,"Y",90,"Y",95,"Y",0,"N",0,"N"]
[37,"1SG15EC038","HARSHA K B",15,15,0,20,20,75,"Y",75,"Y",0,"N",100,"Y",100,"Y"]
[38,"1SG15EC039","HARSHITHA L",14,14,18,0,0,70,"Y",70,"Y",90,"Y",0,"N",0,"N"]
[39,null,"HIMANSHU SHEKHAR",0,0,8,11,11,0,"N",0,"N",40,"N",55,"N",55,"N"]
[40,"1SG15EC041","HIMANSHU TIWARI",15,15,17,0,0,75,"Y",75,"Y",85,"Y",0,"N",0,"N"]
[41,"1SG15EC042","K AKSHAYA",12,12,18,0,0,60,"Y",60,"Y",90,"Y",0,"N",0,"N"]
[42,"1SG15EC043","KANAKA LAKSHMI A",7,7,10,7,7,35,"N",35,"N",50,"N",35,"N",35,"N"]
[43,"1SG15EC044","KANNIKA HEGDE",13,13,19,17,17,65,"Y",65,"Y",95,"Y",85,"Y",85,"Y"]
[44,"1SG15EC045","KARTHIK K",17,17,14,14,14,85,"Y",85,"Y",70,"Y",70,"Y",70,"Y"]
[45,"1SG15EC046","KAVYASHREE G S",16,16,18,17,17,80,"Y",80,"Y",90,"Y",85,"Y",85,"Y"]
[46,"1SG15EC047","KIRAN R",16,16,12,20,20,80,"Y",80,"Y",60,"Y",100,"Y",100,"Y"]
[47,"1SG15EC048","KOSLENDER SINGH",0,0,19,18,18,0,"N",0,"N",95,"Y",90,"Y",90,"Y"]
[48,"1SG15EC049","KOTHOJU SRIDHAR CHARY",4,4,0,6,6,20,"N",20,"N",0,"N",30,"N",30,"N"]
[48,"1SG15EC050","KOUSALYA S",12,12,14,19,19,60,"Y",60,"Y",70,"Y",95,"Y",95,"Y"]
[49,"1SG15EC051","KOUSHALYA D",15,15,18,0,0,75,"Y",75,"Y",90,"Y",0,"N",0,"N"]
[50,"1SG15EC052","KUMARI NEHA",0,0,9,18,18,0,"N",0,"N",45,"N",90,"Y",90,"Y"]
[51,"1SG15EC053","LAVANYA M L",15,15,20,0,0,75,"Y",75,"Y",100,"Y",0,"N",0,"N"]
[52,"1SG15EC054","LINGARAJU L",11,11,19,18,18,55,"N",55,"N",95,"Y",90,"Y",90,"Y"]
[53,"1SG15EC056","MANJUNATHA NAIK N",8,8,5,15,15,40,"N",40,"N",25,"N",75,"Y",75,"Y"]
[54,"1SG15EC057","MANOJ G",14,14,12,15,15,70,"Y",70,"Y",60,"Y",75,"Y",75,"Y"]
[55,"1SG15EC058","MANU RAJ SINGH",12,12,0,4,4,60,"Y",60,"Y",0,"N",20,"N",20,"N"]
[56,"1SG15EC059","MEGHANA A S",19,19,20,19,19,95,"Y",95,"Y",100,"Y",95,"Y",95,"Y"]
[57,"1SG15EC060","MOHAMMED SHAHID",15,15,0,15,15,75,"Y",75,"Y",0,"N",75,"Y",75,"Y"]
[58,"1SG15EC061","MOHAN VARMA K",15,15,20,0,0,75,"Y",75,"Y",100,"Y",0,"N",0,"N"]
[59,"1SG15EC062","MOHIT SHARMA",0,0,14,11,11,0,"N",0,"N",70,"Y",55,"N",55,"N"]
[null,"1SG15EC063","MOTILAL",1,1,11,12,12,5,"N",5,"N",null,null,60,"Y",60,"Y"]
[60,"1SG15EC064","NAYANA H J",17,17,20,0,0,85,"Y",85,"Y",100,"Y",0,"N",0,"N"]
[61,"1SG15EC065","NEHA S",18,18,19,0,0,90,"Y",90,"Y",95,"Y",0,"N",0,"N"]
[62,"1SG15EC066","NIDA SULTHANA N",20,20,20,0,0,100,"Y",100,"Y",100,"Y",0,"N",0,"N"]
[63,"1SG15EC067","NIKHIL R A",15,15,16,0,0,75,{"$f":"IF(I75<60,\"N\",\"Y\")","v":"Y"},75,"Y",80,"Y",0,"N",0,"N"]
[null,"1SG15EC069","NISHAL KUMAR TIWARI",10,{"$f":"D76","v":10},0,13,13,null,null,50,"N",0,"N",{"$f":"(G76/0.2)","v":65},{"$f":"IF(O76<60,\"N\",\"Y\")","v":"Y"},{"$f":"(H76/0.2)","v":65},{"$f":"IF(Q76<60,\"N\",\"Y\")","v":"Y"}]
[64,"1SG15EC069","NISHANT KUMAR",16,16,16,0,0,80,{"$f":"IF(I77<60,\"N\",\"Y\")","v":"Y"},80,"Y",80,{"$f":"IF(M77<60,\"N\",\"Y\")","v":"Y"},0,"N",0,"N"]
[65,"1SG15EC070","NIVEDITHA M",20,20,20,0,0,{"$f":"D78/0.2","v":100},"Y",{"$f":"E78/0.2","v":100},"Y",{"$f":"((F78)/0.2)","v":100},"Y",0,"N",0,"N"]
[66,"1SG15EC071","NIVEDITHA S",14,14,11,0,{"$f":"G79","v":0},70,"Y",70,"Y",55,"N",0,"N",0,"N"]
[67,"1SG15EC072","PAVITHRA J",18,18,20,0,0,90,"Y",90,"Y",100,"Y",0,"N",0,"N"]
[68,"1SG15EC073","PAVITRA",17,17,19,0,0,85,"Y",85,"Y",95,"Y",0,"N",0,"N"]
[69,"1SG15EC074","POOJA R",10,10,14,0,0,50,"N",50,"N",70,"Y",0,"N",0,"N"]
[70,"1SG15EC075","POOJA S BHAT",20,20,20,0,0,100,"Y",100,"Y",100,"Y",0,"N",0,"N"]
[71,"1SG15EC076","PRAJWAL K",11,11,16,0,0,55,"N",55,"N",80,"Y",0,"N",0,"N"]
[72,"1SG15EC077","PRAJWAL S",7,7,12,13,13,35,"N",35,"N",60,"Y",65,"Y",65,"Y"]
[73,"1SG15EC078","PRASHANT RAJPUT",11,11,14,0,0,55,"N",55,"N",70,"Y",0,"N",0,"N"]
[74,"1SG15EC079","PRASHANT SRIVASTAVA",0,0,15,14,14,0,"N",0,"N",75,"Y",70,"Y",70,"Y"]
[75,"1SG15EC080","PRATEEK KUMAR THAKUR",20,20,20,0,0,100,"Y",100,"Y",100,"Y",0,"N",0,"N"]
[76,"1SG15EC081","PRATHIBHA K",15,15,20,0,0,75,"Y",75,"Y",100,"Y",0,"N",0,"N"]
[77,"1SG15EC082","PREMA K S",14,14,12,0,0,70,"Y",70,"Y",60,"Y",0,"N",0,"N"]
[78,"1SG15EC083","PRIYADARSHINI C",13,13,17,0,0,65,"Y",65,"Y",85,"Y",0,"N",0,"N"]
[79,"1SG15EC084","PRUTHVI R",12,12,11,17,17,60,"Y",60,"Y",55,"N",85,"Y",85,"Y"]
[80,"1SG15EC085","R REKHA",20,20,17,0,0,100,"Y",100,"Y",85,"Y",0,"N",0,"N"]
[81,"1SG15EC086","RAJ KUMAR",18,18,20,0,0,90,"Y",90,"Y",100,"Y",0,"N",0,"N"]
[82,"1SG15EC087","RAKSHA G R",20,20,20,0,0,100,"Y",100,"Y",100,"Y",0,"N",0,"N"]
[83,"1SG15EC088","RANJAN S",16,16,8,19,19,80,"Y",80,"Y",40,"N",95,"Y",95,"Y"]
[84,"1SG15EC089","RANJITH GOWDA B",16,16,15,0,0,80,"Y",80,"Y",75,"Y",0,"N",0,"N"]
[85,"1SG15EC090","RAVI C",10,10,13,0,0,50,"N",50,"N",65,"Y",0,"N",0,"N"]
[86,"1SG15EC091","SAI SIDDHARTH M",6,6,13,12,12,30,"N",30,"N",65,"Y",60,"Y",60,"Y"]
[87,"1SG15EC092","SANDHYA V",8,8,0,17,17,40,"N",40,"N",0,"N",85,"Y",85,"Y"]
[88,"1SG15EC093","SANDHYA Y G",12,12,0,19,19,60,"Y",60,"Y",0,"N",95,"Y",95,"Y"]
[89,"1SG15EC094","SANJANA A S",17,17,17,18,18,85,"Y",85,"Y",85,"Y",90,"Y",90,"Y"]
[90,"1SG15EC095","SANJAY KUMAR B N",11,{"$f":"D103","v":11},10,12,12,55,"N",55,"N",50,"N",60,"Y",60,"Y"]
[null,"1SG15EC096","SANJAY KUMAR L",8,{"$f":"D104","v":8},10,13,{"$f":"G104","v":13},40,"N",40,"N",50,"N",65,"Y",65,"Y"]
[91,"1SG15EC098","SHASHANK H S",13,13,10,0,0,65,"Y",65,"Y",50,"N",0,"N",0,"N"]
[92,"1SG15EC099","SHASHANK SHEKHAR",0,0,14,12,12,0,"N",0,"N",70,"Y",60,"Y",60,"Y"]
[93,"1SG15EC100","SHASHIKANT KUMAR",11,11,5,12,12,55,"N",55,"N",25,"N",60,"Y",60,"Y"]
[94,"1SG15EC101","SHRISH JHA",14,14,16,0,0,70,"Y",70,{"$f":"IF(K108<60,\"N\",\"Y\")","v":"Y"},80,"Y",0,"N",0,"N"]
[95,"1SG15EC102","SHUBHAM KUMAR",15,15,18,16,16,75,"Y",75,"Y",90,"Y",80,"Y",80,"Y"]
[96,"1SG15EC103","SHUBHAM KUMAR(D)",12,12,7,11,11,60,"Y",60,"Y",35,"N",55,"N",55,"N"]
[97,"1SG15EC104","SHUBHAM KUMAR MISHRA",15,15,20,0,0,75,"Y",75,"Y",100,"Y",0,"N",0,"N"]
[98,"1SG15EC105","SMITHA B BIRADAR",9,9,15,0,0,45,"N",45,"N",75,"Y",0,"N",0,"N"]
[null,"1SG15EC106","SONAM KUMARI",0,{"$f":"D118-D1179","v":0},7,2,2,{"$f":"D113/0.2","v":0},"N",0,"N",35,"N",10,"N",10,"N"]
[99,"1SG15EC107","SUBHAM SHEKHAR PANDEY",0,0,16,20,20,0,"N",0,"N",80,"Y",100,"Y",100,"Y"]
[100,"1SG15EC108","SUKANYA KRISHNA POOJARI",16,16,17,0,0,80,"Y",80,"Y",85,"Y",0,"N",0,"N"]
[null,"1SG15EC109","SUMAIYA  I",10,{"$f":"D116","v":10},7,13,13,50,"N",50,"N",{"$f":"((F116)/0.2)","v":35},{"$f":"IF(M116<60,\"N\",\"Y\")","v":"N"},65,"Y",65,"Y"]
[101,"1SG15EC110","SUMALATHA N",12,12,11,8,8,60,"Y",60,"Y",55,"N",40,"N",40,"N"]
[102,"1SG15EC111","USHA KIRAN S",0,0,10,13,13,0,"N",0,"N",50,"N",65,"Y",65,"Y"]
[103,"1SG15EC112","VAISHNAVI R SHETTY",0,0,9,19,19,0,"N",0,"N",45,"N",95,"Y",95,"Y"]
[104,"1SG15EC113","VARSHINI N(D)",10,10,17,0,0,50,"N",50,"N",85,"Y",0,"N",0,"N"]
[105,"1SG15EC114","VEERESH M",15,15,19,17,17,75,"Y",75,"Y",95,"Y",85,"Y",85,"Y"]
[106,"1SG15EC115","VIKAS KASHYAP",20,20,20,0,0,100,"Y",100,"Y",100,"Y",0,"N",0,"N"]
[107,"1SG15EC116","VINAYAKA L S",10,10,13,0,0,50,"N",50,"N",65,"Y",0,"N",0,"N"]
[null,"1SG13EC131","RAMYA SK JADAV",0,{"$f":"D124","v":0},14,17,{"$f":"G124","v":17},0,"N",0,"N",70,"Y",85,"Y",85,"Y"]
[{"$nulls":9},{"$f":"COUNTIF(J11:J124,\"y\")","v":68},null,{"$f":"COUNTIF(L11:L124,\"y\")","v":68},null,{"$f":"COUNTIF(N11:N124,\"y\")","v":82},null,{"$f":"COUNTIF(P11:P124,\"y\")","v":47},null,{"$f":"COUNTIF(R11:R124,\"y\")","v":47}]
[]
[]
[{"$nulls":8},"IA MARKS ATTAINMENT",null,68,68,82,47,47]

{"sheet":"C-Sec","index":1,"n_rows":64,"n_cols":24,"rows_kept":64,"hidden":true,"merged":[[0,1,0,23],[1,1,1,23],[2,1,2,23],[3,0,6,0],[3,1,6,1],[3,2,6,2],[3,3,4,7],[3,8,3,15],[3,16,3,23],[4,8,4,11],[4,12,4,15],[4,16,4,19],[4,20,4,23],[55,1,55,2],[56,1,56,2],[57,1,57,2],[58,1,58,2],[59,1,59,2],[60,1,60,2],[61,1,61,2],[63,1,63,2]]}
[null,"Acharya Institute of Technology"]
[null,"Department of Computer Science and Engineering"]
[null,"VI Semester C Section Test marks for Even Sem 2013-14"]
["Sl. No.","Name of the student","USN","I INTERNALS",{"$nulls":4},"II INTERNALS",{"$nulls":7},"III INTERNALS"]
[{"$nulls":8},"PART A",{"$nulls":3},"PART B",{"$nulls":3},"PART A",{"$nulls":3},"PART B"]
[{"$nulls":3},1,2,3,4,5,1,2,3,4,5,6,7,8,1,2,3,4,5,6,7,8]
[{"$nulls":3},"CO 1","CO 2","CO 3","CO 3","CO 3","CO 3","CO 3","CO 3","CO 3","CO 1","CO 4","CO 4","CO 4","CO 4","CO 4","CO 4","CO 4","CO 4","CO 4","CO 5","CO 5"]
[1,"SRINIDHI P C","1AY11CS113",10,10,7,10,10,10,10,10,null,null,10,9,null,10,null,null,9,10,9,null,10]
[2,"SHRUTHIKA C RAMPURE","1AY11CS114",10,7,9,9,4,9,9,9,9,null,9,9,10]
[3,"SNEHA  KUMARI","1AY11CS115",10,8,9,10,9,10,null,9,10,null,9,10,9,10,10,10,10,4,null,null,10]
[4,"SOMEN GORAIN","1AY11CS116",null,10,9,9,7,10,null,10,null,10,null,10,10,8,null,10,10,null,10,null,10]
[5,"SOUVIK KUNDU","1AY11CS117",10,10,9,5,7,null,null,10,7,10,10,10,null,null,10,10,10,6,10,6]
[6,"SOWMYA NAGARAJU","1AY11CS118",3,8,10,8,5,null,null,8,10,4,null,null,8,5,null,10,10,6,10,null,10]
[7,"SRISTI KUMARI","1AY11CS120",10,3,7,5,{"$nulls":3},7,7,10,null,9,9]
[8,"SUBAS THAPA","1AY11CS121",7,3,10,4,6,9,null,9,null,null,10,10,8,10,null,10,10,null,10,null,9]
[9,"SUKANYA BOSE","1AY11CS122",7,5,8,null,null,3,9,9,5,6,4,0,4,6,null,9,4,null,6]
[10,"SUMIT KUMAR","1AY11CS123",10,3,8,5,{"$nulls":5},8,4,10,5,10,null,null,10,4,null,10,10]
[11,"SUPRIYA","1AY11CS124",7,8,9,9,7,null,8,9,null,null,10,6,10,8,null,10,10,8,8,null,10]
[12,"SURENDRA D","1AY11CS125",10,null,9,9,7,10,null,10,8,10,null,10,6,10,6,10,6,4,null,null,10]
[13,"SWATI .M .S","1AY11CS127",10,3,10,4,9,7,null,9,5,null,8,9,9,8,8,10,10,8,8,null,10]
[14,"TAJ UNNISA","1AY11CS128",10,8,9,10,10,8,9,null,9,10,9,10]
[15,"TANUSHREE .Y","1AY11CS129",10,4,9,10,6,10,null,10,4,null,8,10,10,null,10,10,null,10,10,null,10]
[16,"UMESH KUMAR","1AY11CS131",{"$nulls":5},7,9,null,9,7,4,6,null,6,null,10,null,8,10,null,10]
[17,"V PRADEEP","1AY11CS133",2,10,9,9,10,9,null,7,null,null,10,4,10]
[18,"VISHAL KUMAR","1AY11CS135",10,10,10,10,10,null,8,5,null,10,2,10,8]
[19,"VISHNU .N","1AY11CS136",10,9,9,10,7,10,10,null,null,10,10,10]
[20,"YOGESH.N","1AY11CS137",10,10,9,10,9,10,10,9,null,10,10,10]
[21,"SNEHA KULHALLI","1AY11CS140",10,3,7,7,5,5,7,5,5,null,6,9,null,10,null,10,null,8,6,null,10]
[22,"AKSHITHA C","1AY12CS400",7,null,9,7,5,8,null,8,null,null,4,4,4,8,null,8,8,null,8]
[23,"B B VIKAS","1AY12CS401",{"$nulls":6},8,7,null,10,4,10,null,5,2,10,5,2,8,null,10]
[24,"BALAJI P","1AY12CS402",{"$nulls":6},7,{"$nulls":3},6,10,5,8,4,10,null,null,8,10]
[25,"BASANAGOUDA","1AY12CS403",{"$nulls":5},9,7,{"$nulls":3},4,9,4,null,8,10,8,10,8,null,10]
[26,"BASAVARAJ S","1AY12CS404",9,9,{"$nulls":3},8,null,9,null,null,4,null,4,5,null,10,10,4,9,null,10]
[27,"DIVYA KALA M","1AY12CS405",10,8,9,9,9,9,8,null,null,10,4,9,4,8,8,10,null,8,8]
[28,"DIVYA L","1AY12CS406",10,2,7,null,null,7,5,{"$nulls":3},4,4,5,10,null,4,10,3,6,4]
[29,"GOPAL RAJ J T","1AY12CS407",9,null,9,9,7,null,5,null,5,null,4,6,4,4,null,6,null,8,8,8]
[30,"GURURAJ M S","1AY12CS408",9,8,9,7,7,null,null,5,8,null,10,7,null,8,8,10,5,5,null,null,10]
[31,"JHANHAVI V","1AY12CS410",8,5,9,5,6,9,null,null,8,10,9,9,8,8,null,8,10,8,null,null,8]
[32,"LOHITH R R","1AY12CS411",null,null,6,7,6,null,9,10,null,null,10,10,10,10,8,10,null,null,8,null,6]
[33,"MALLIKARJUN","1AY12CS412",{"$nulls":5},4,6,null,null,2,4,5,4,8,8,10,3,null,8]
[34,"MANJU S","1AY12CS414",null,null,10,10,3,null,null,7,9,null,9,9,9,8,8,10,10,null,8]
[35,"MEGHANA K K","1AY12CS415",9,null,7,{"$nulls":10},5,5,10,8,null,8,5,8]
[36,"MONICA SM","1AY12CS416",10,9,5,5,5,4,null,null,4,10,4,null,4,8,10,10,null,null,8,null,10]
[37,"NAVEEN KUMAR K S","1AY12CS417",{"$nulls":7},5,5,null,4,null,4,10,null,10,null,6,10,null,10]
[38,"NAYANA R R","1AY12CS418",10,9,null,6,5,{"$nulls":8},6,6,null,null,3,4,null,10]
[39,"PAVITHRA HJ","1AY12CS419",{"$nulls":5},8,8,null,null,10,4,4,4,5,null,8,8,4,null,4,10]
[40,"PRASHANTH V","1AY12CS420",8,2,9,9,1,8,null,10,null,null,9,10,9]
[41,"PRAVEEN KUMAR B","1AY12CS421",9,6,6,9,8,8,9,9,null,null,4,null,4,5,null,8,8,8,null,null,8]
[42,"PUTTARAJU B K","1AY12CS422",8,null,5,3,null,null,4,4,null,9,null,10,3,null,null,10,10,null,4,null,10]
[43,"RADHAKRISHNA G","1AY12CS423",6,null,5,5,5,8,null,8,null,null,4,4,10,6,null,6,6,10,10,null,10]
[44,"SANTHOSH KUMAR G P","1AY12CS425",9,7,9,9,7,7,7,7,null,10,4,10,4]
[45,"SHREYAS P","1AY12CS426",10,5,6,5,5,4,null,4,null,9,2,8]
[46,"SHRIDHAR REDDY","1AY12CS427",{"$nulls":7},3,null,null,4,null,7,6,null,9,10,10,9,null,8]
[47,"VIDYA G","1AY12CS430",10,9,9,8,null,9,7,null,null,10,4,8,{"$nulls":3},10,10,null,8,null,6]
[]
[null,"No of students between 9-10",null,{"$f":"COUNTIF(D6:D54,\"=9\")+COUNTIF(D6:D54,\"=10\")","v":26},{"$f":"COUNTIF(E6:E54,\"=9\")+COUNTIF(E6:E54,\"=10\")","v":11},24,18,8,14,9,16,6,17,15,26,12,9,4,27,16,5,11,2,22]
[null,"No of students between 7-8",null,{"$f":"COUNTIF(D6:D54,\"=7\")+COUNTIF(D6:D54,\"=8\")","v":7},{"$f":"COUNTIF(E6:E54,\"=7\")+COUNTIF(E6:E54,\"=8\")","v":8},7,6,9,11,10,8,5,2,2,4,6,11,7,4,5,8,14,2,5]
[null,"No of students between 5-6",null,{"$f":"COUNTIF(D6:D54,\"=5\")+COUNTIF(D6:D54,\"=6\")","v":1},{"$f":"COUNTIF(E6:E54,\"=5\")+COUNTIF(E6:E54,\"=6\")","v":4},6,8,12,1,3,4,5,2,3,4,4,11,3,2,4,5,4,2,2]
[null,"No of students between 3-4",null,{"$f":"COUNTIF(D6:D54,\"=3\")+COUNTIF(D6:D54,\"=4\")","v":1},{"$f":"COUNTIF(E6:E54,\"=3\")+COUNTIF(E6:E54,\"=4\")","v":6},1,4,2,4,1,4,3,1,19,5,13,1,1,2,3,7,2,2,0]
[null,"No of students between 1-2",null,{"$f":"COUNTIF(D6:D54,\"=1\")+COUNTIF(D6:D54,\"=2\")","v":2},{"$f":"COUNTIF(E6:E54,\"=1\")+COUNTIF(E6:E54,\"=2\")","v":3},0,0,1,1,1,0,0,1,2,0,0,1,2,0,0,1,0,0,0]
[null,"No of students scored 0",null,{"$f":"COUNTIF(D6:D54,\"=0\")","v":0},{"$f":"COUNTIF(E6:E54,\"=0\")","v":0},0,0,0,0,0,0,0,0,0,1,0,0,0,0,0,0,0,0,0]
[null,"Absentees",null,{"$f":"COUNTBLANK(D6:D54)","v":11},{"$f":"COUNTBLANK(E6:E54)","v":16},10,12,16,17,24,16,29,25,7,8,13,15,31,13,20,22,17,40,19]
[]
[null,"Attainment",null,{"$f":"((0.35*D56)+(0.3*D57)+(0.2*D58)+(0.1*D59)+(0.05*D60)+(0*D61))/(0.35*(D56+D57+D58+D59+D60+D61))*100","v":{"v":89.57528957528956,"d":"89.58"}},{"$f":"((0.35*E56)+(0.3*E57)+(0.2*E58)+(0.1*E59)+(0.05*E60)+(0*E61))/(0.35*(E56+E57+E58+E59+E60+E61))*100","v":{"v":69.64285714285715,"d":"69.64"}},{"v":88.7218045112782,"d":"88.72"},{"v":80.15873015873017,"d":"80.16"},{"v":72.76785714285715,"d":"72.77"},{"v":81.5668202764977,"d":"81.57"},{"v":82.14285714285715,"d":"82.14"},{"v":82.14285714285717,"d":"82.14"},{"v":73.68421052631578,"d":"73.68"},{"v":88.19875776397515,"d":"88.20"},{"v":58.88501742160278,"d":"58.89"},{"v":82.85714285714285,"d":"82.86"},{"v":66.12244897959184,"d":"66.12"},{"v":76.19047619047619,"d":"76.19"},{"v":72.2689075630252,"d":"72.27"},{"v":91.83673469387755,"d":"91.84"},{"v":83.6734693877551,"d":"83.67"},{"v":64.83516483516483,"d":"64.84"},{"v":83.41013824884793,"d":"83.41"},{"v":67.85714285714285,"d":"67.86"},{"v":94.58128078817735,"d":"94.58"}]

{"sheet":"Sheet1","index":2,"n_rows":10,"n_cols":24,"rows_kept":10,"hidden":true,"merged":[[1,0,3,0],[1,1,3,1],[1,2,1,20],[1,21,3,21],[1,22,3,22],[2,2,2,3],[2,4,2,5],[2,6,2,7],[2,10,2,11],[2,12,2,13],[2,14,2,15],[8,0,8,1]]}
["Course outcomes-Program outcomes mapping  & Attainment table:"]
["COs","COs attained in %","Program outcomes",{"$nulls":18},"Total","Attainment level of Program Outcomes in % (Average)","Achievement"]
[null,null,"a",null,"b",null,"c",null,"d",null,"e",null,"f",null,"g",null,"h","i","j","k","l"]
[null,null,"leve","Attainment","leve","Attainment","leve","Attainment","leve","Attainment","leve","Attainment","leve","Attainment","leve","Attainment",{"$nulls":7},"(Threshold Goal:70%)"]
["CO1",85,1,{"$f":"(C5/C9)*B5","v":10.625},null,null,10.625]
["CO2",90,2,{"$f":"(C6/C9)*B6","v":22.5},null,null,22.5]
["CO3",83,3,{"$f":"(C7/C9)*B7","v":31.125},null,null,31.125]
["CO4",75,2,{"$f":"(C8/C9)*B8","v":18.75},null,null,18.75]
["Total",null,8]
["Note: Mapping in terms of Slight (1), Moderate(2), Good(3) and Excellent(4) levels and COs need not map all POS"]

{"sheet":"Sheet2","index":3,"n_rows":97,"n_cols":17,"rows_kept":97,"hidden":true,"merged":[[4,0,5,0],[4,1,5,1],[4,2,4,13],[4,14,5,14],[10,0,10,1],[16,2,16,8],[16,9,16,12],[16,13,16,16],[17,0,18,1],[17,2,17,15],[17,16,18,16],[18,8,18,9],[18,12,18,13],[19,0,19,1],[19,8,19,9],[19,12,19,13],[20,0,20,1],[20,8,20,9],[20,12,20,13],[21,0,21,1],[21,8,21,9],[21,12,21,13],[22,0,22,1],[22,8,22,9],[22,12,22,13],[23,0,23,1],[23,8,23,9],[23,12,23,13],[24,0,24,1],[24,8,24,9],[24,12,24,13]]}
[]
[]
[]
[]
["COs","Avg. COs attained in %","Program outcomes",{"$nulls":11},"Attainment level of Program Outcomes in % (Average)","Achievement"]
[null,null,"a","b","c","d","e","f","g","h","i","j","k","l",null,"(Threshold Goal:70%)"]
["CO1",85,4]
["CO2",90]
["CO3",83]
["CO4",75]
["Total"]
[]
[]
[]
[]
[]
["Subject Code :","10ME64","Title: Finite Element Methods",{"$nulls":6},"Faculty Name: ",{"$nulls":3},"Manjunatha B."]
["List of Course outcomes",null,"Program Outcomes",{"$nulls":13},"Total"]
[null,null,"a","b","c","d","e","f","g",null,"h","I","J",null,"k","l"]
["CO-1",null,4,2,1,"-","-","-","-",null,"-",1,"-",null,2,"-",9]
["CO-2",null,2,4,2,2,2,"-","-",null,"-","-","-",null,"-",3,15]
["CO-3 ",null,1,4,3,2,4,"-","-",null,"-","-","-",null,"-",3,17]
["CO-4",null,2,4,2,"-","-","-","-",null,"-","-","-",null,"-","-",8]
["CO-5",null,"-","-","-",2,1,"-","-",null,"-",2,"-",null,2,"-",7]
["Total",null,9,14,7,6,7,"-","-",null,"-",3,"-",null,4,6,50]
{"$rows_empty":42}
[null,"a","b","c","d","e","f","g","h","i","j","k","l"]
["co1",4,2,1,"-","-","-","-","-",1,"-",2,"-",10]
["co2",2,4,2,2,2,"-","-","-","-","-","-",3,15]
["co3",1,4,3,2,4,"-","-","-","-","-","-",3,17]
["co4",2,4,2,"-","-","-","-","-","-","-","-","-",8]
["co5","-","-","-",2,1,"-","-","-",2,"-",2,"-",7]
[null,9,14,8,6,7,"-","-","-",3,"-",4,6,57]
[]
[null,85,73,1,"-","-","-","-","-",1,"-",2,"-",10]
[null,85,70,2,2,2,"-","-","-","-","-","-",3,15]
[null,85,84,3,2,4,"-","-","-","-","-","-",3,17]
[null,85,84,2,"-","-","-","-","-","-","-","-","-",8]
[null,"-","-","-",2,1,"-","-","-",2,"-",2,"-",7]
[null,9,14,8,6,7,"-","-","-",3,"-",4,6,57]
[]
[]
[null,{"$f":"IF(B69=\"-\",0,B69)/B$74","v":{"v":0.4444444444444444,"d":"0.44"}},{"$f":"IF(C69=\"-\",0,C69)/C$74","v":{"v":0.14285714285714285,"d":"0.14"}},{"v":0.125,"d":"0.13"},{"v":0,"d":"0.00"},{"v":0,"d":"0.00"},{"$error":"#VALUE!"},{"$error":"#VALUE!"},{"$error":"#VALUE!"},{"v":0.3333333333333333,"d":"0.33"},{"$error":"#VALUE!"},{"v":0.5,"d":"0.50"},{"v":0,"d":"0.00"},10]
[null,{"$f":"IF(B70=\"-\",0,B70)/B$74","v":{"v":0.2222222222222222,"d":"0.22"}},{"v":0.2857142857142857,"d":"0.29"},0.25,{"v":0.3333333333333333,"d":"0.33"},{"v":0.2857142857142857,"d":"0.29"},{"$error":"#VALUE!"},{"$error":"#VALUE!"},{"$error":"#VALUE!"},{"v":0,"d":"0.00"},{"$error":"#VALUE!"},{"v":0,"d":"0.00"},{"v":0.5,"d":"0.50"},15]
[null,{"v":0.1111111111111111,"d":"0.11"},{"v":0.2857142857142857,"d":"0.29"},{"v":0.375,"d":"0.38"},{"v":0.3333333333333333,"d":"0.33"},{"v":0.5714285714285714,"d":"0.57"},{"$error":"#VALUE!"},{"$error":"#VALUE!"},{"$error":"#VALUE!"},{"v":0,"d":"0.00"},{"$error":"#VALUE!"},{"v":0,"d":"0.00"},{"v":0.5,"d":"0.50"},17]
[null,{"v":0.2222222222222222,"d":"0.22"},{"v":0.2857142857142857,"d":"0.29"},0.25,{"v":0,"d":"0.00"},{"v":0,"d":"0.00"},{"$error":"#VALUE!"},{"$error":"#VALUE!"},{"$error":"#VALUE!"},{"v":0,"d":"0.00"},{"$error":"#VALUE!"},{"v":0,"d":"0.00"},{"v":0,"d":"0.00"},8]
[null,{"v":0,"d":"0.00"},{"v":0,"d":"0.00"},{"v":0,"d":"0.00"},{"v":0.3333333333333333,"d":"0.33"},{"v":0.14285714285714285,"d":"0.14"},{"$error":"#VALUE!"},{"$error":"#VALUE!"},{"$error":"#VALUE!"},{"v":0.6666666666666666,"d":"0.67"},{"$error":"#VALUE!"},{"v":0.5,"d":"0.50"},{"v":0,"d":"0.00"},7]
[null,{"$f":"B74/B$74","v":{"v":1,"d":"1.00"}},{"v":1,"d":"1.00"},{"v":1,"d":"1.00"},{"v":1,"d":"1.00"},{"v":1,"d":"1.00"},{"$error":"#VALUE!"},{"$error":"#VALUE!"},{"$error":"#VALUE!"},{"v":1,"d":"1.00"},{"$error":"#VALUE!"},{"v":1,"d":"1.00"},{"v":1,"d":"1.00"},57]
[]
[]
[null,{"$f":"B84*B76","v":{"v":37.77777777777778,"d":"37.8"}},{"$f":"C84*C76","v":{"v":10.428571428571429,"d":"10.4"}},{"v":0.125,"d":"0.1"},{"$error":"#VALUE!"},{"$error":"#VALUE!"},{"$error":"#VALUE!"},{"$error":"#VALUE!"},{"$error":"#VALUE!"},{"v":0.3333333333333333,"d":"0.3"},{"$error":"#VALUE!"},{"v":1,"d":"1.0"},{"$error":"#VALUE!"},{"v":10,"d":"10.0"}]
[null,{"$f":"B85*B77","v":{"v":18.88888888888889,"d":"18.9"}},{"$f":"C85*C77","v":{"v":20,"d":"20.0"}},0.5,{"v":0.6666666666666666,"d":"0.7"},{"v":0.5714285714285714,"d":"0.6"},{"$error":"#VALUE!"},{"$error":"#VALUE!"},{"$error":"#VALUE!"},{"$error":"#VALUE!"},{"$error":"#VALUE!"},{"$error":"#VALUE!"},1.5,{"v":15,"d":"15.0"}]
[null,{"$f":"B86*B78","v":{"v":9.444444444444445,"d":"9.4"}},{"$f":"C86*C78","v":{"v":24,"d":"24.0"}},{"v":1.125,"d":"1.1"},{"v":0.6666666666666666,"d":"0.7"},{"v":2.2857142857142856,"d":"2.3"},{"$error":"#VALUE!"},{"$error":"#VALUE!"},{"$error":"#VALUE!"},{"$error":"#VALUE!"},{"$error":"#VALUE!"},{"$error":"#VALUE!"},1.5,{"v":17,"d":"17.0"}]
[null,{"$f":"B87*B79","v":{"v":18.88888888888889,"d":"18.9"}},{"$f":"C87*C79","v":{"v":24,"d":"24.0"}},0.5,{"$error":"#VALUE!"},{"$error":"#VALUE!"},{"$error":"#VALUE!"},{"$error":"#VALUE!"},{"$error":"#VALUE!"},{"$error":"#VALUE!"},{"$error":"#VALUE!"},{"$error":"#VALUE!"},{"$error":"#VALUE!"},{"v":8,"d":"8.0"}]
[null,{"$f":"B88*IF(B80=\"-\",0,B88)","v":{"v":0,"d":"0.0"}},{"$f":"C88*IF(C80=\"-\",0,C88)","v":{"v":0,"d":"0.0"}},{"v":0,"d":"0.0"},{"v":0.1111111111111111,"d":"0.1"},{"v":0.02040816326530612,"d":"0.0"},{"$error":"#VALUE!"},{"$error":"#VALUE!"},{"$error":"#VALUE!"},{"v":0.4444444444444444,"d":"0.4"},{"$error":"#VALUE!"},{"v":0.25,"d":"0.3"},{"v":0,"d":"0.0"},{"v":7,"d":"7.0"}]
[null,{"$f":"SUM(B92:B96)","v":{"v":85,"d":"85.0"}},{"$f":"SUM(C92:C96)","v":{"v":78.42857142857143,"d":"78.4"}},{"v":2.25,"d":"2.3"},{"$error":"#VALUE!"},{"$error":"#VALUE!"},{"$error":"#VALUE!"},{"$error":"#VALUE!"},{"$error":"#VALUE!"},{"$error":"#VALUE!"},{"$error":"#VALUE!"},{"$error":"#VALUE!"},{"$error":"#VALUE!"},{"v":57,"d":"57.0"}]

{"sheet":"Assignment","index":4,"n_rows":125,"n_cols":18,"rows_kept":125,"merged":[[0,1,0,11],[1,1,1,11],[2,2,2,10],[3,1,3,11],[4,0,7,0],[4,1,7,1],[4,2,7,2],[4,3,5,7],[4,8,6,17],[7,8,7,9],[7,10,7,11],[7,12,7,13],[7,14,7,15],[7,16,7,17],[8,12,8,13],[8,14,8,15],[8,16,8,17]]}
[null,"Sapthagiri College of Engineering"]
[null,"Department of Electronics and Communication Engineering"]
[null,null,"Basic Electronics (15ELN15) G & H sections"]
[null,"II Semester Test marks for EVEN Sem 2015-16"]
["Sl. No.","USN","NAME","Assignment",{"$nulls":4},"Course Objectives"]
[]
[]
[{"$nulls":3},"CO 1","CO2","CO3","CO4","C","CO1",null,"CO2",null,"CO3",null,"CO 4",null,"C0 5"]
[null,null,"MAX MARKS",5,5,5,5,5]
[{"$nulls":8},"%",null,"%",null,"%",null,"%",null,"%"]
[1,"1SG15EC001","ABHIJITH N",5,5,5,5,5,{"$f":"D11/0.05","v":100},{"$f":"IF(I11<60,\"N\",\"Y\")","v":"Y"},{"$f":"F11/0.05","v":100},{"$f":"IF(K11<60,\"N\",\"Y\")","v":"Y"},{"$f":"H11/0.05","v":100},{"$f":"IF(M11<60,\"N\",\"Y\")","v":"Y"},{"$f":"(G11/0.05)","v":100},{"$f":"IF(O11<60,\"N\",\"Y\")","v":"Y"},{"$f":"(H11/0.05)","v":100},"Y"]
[2,"1SG15EC002","ABHISHEK K",5,5,5,5,5,{"$f":"D12/0.05","v":100},{"$f":"IF(I12<60,\"N\",\"Y\")","v":"Y"},{"$f":"F12/0.05","v":100},{"$f":"IF(K12<60,\"N\",\"Y\")","v":"Y"},{"$f":"H12/0.05","v":100},{"$f":"IF(M12<60,\"N\",\"Y\")","v":"Y"},{"$f":"(G12/0.05)","v":100},{"$f":"IF(O12<60,\"N\",\"Y\")","v":"Y"},{"$f":"(H12/0.05)","v":100},{"$f":"IF(Q12<60,\"N\",\"Y\")","v":"Y"}]
[3,"1SG15EC003","ABHISHEK N",5,5,5,5,5,100,"Y",100,"Y",100,"Y",100,"Y",100,"Y"]
[4,"1SG15EC004","ADITYA P THAKKER",5,5,5,5,5,100,"Y",100,"Y",100,"Y",100,"Y",100,"Y"]
[5,"1SG15EC006","AISHWARYA G",5,5,5,5,5,100,"Y",100,"Y",100,"Y",100,"Y",100,"Y"]
[6,"1SG15EC007","AKHIL SINGH",5,5,5,5,5,100,"Y",100,"Y",100,"Y",100,"Y",100,"Y"]
[7,"1SG15EC008","ANJALI V JAKATI",5,5,5,5,5,100,"Y",100,"Y",100,"Y",100,"Y",100,"Y"]
[8,"1SG15EC009","ANJAN O",5,5,5,5,5,100,"Y",100,"Y",100,"Y",100,"Y",100,"Y"]
[9,"1SG15EC010","ANKIT PRIYAM",5,5,5,5,5,100,"Y",100,"Y",100,"Y",100,"Y",100,"Y"]
[10,"1SG15EC011","ANKIT SHIVHARE",5,5,5,5,5,100,"Y",100,"Y",100,"Y",100,"Y",100,"Y"]
[11,"1SG15EC012","ANN NILEENA HENRY C",5,5,5,5,5,100,"Y",100,"Y",100,"Y",100,"Y",100,"Y"]
[12,"1SG15EC013","ANU PRIYE",5,5,5,5,5,100,"Y",100,"Y",100,"Y",100,"Y",100,"Y"]
[13,"1SG15EC014","APOORVA G A",5,5,5,5,5,100,"Y",100,"Y",100,"Y",100,"Y",100,"Y"]
[14,"1SG15EC015","ARCHANA B S",5,5,5,5,5,100,"Y",100,"Y",100,"Y",100,"Y",100,"Y"]
[15,"1SG15EC016","ASHWANI GUPTA",5,5,5,5,5,100,"Y",100,"Y",100,"Y",100,"Y",100,"Y"]
[16,"1SG15EC017","ASHWIN V",5,5,5,5,5,100,"Y",100,"Y",100,"Y",100,"Y",100,"Y"]
[17,"1SG15EC018","B NIKHILESHWAR REDDY",5,5,5,5,5,100,"Y",100,"Y",100,"Y",100,"Y",100,"Y"]
[18,"1SG15EC019","BHAVYA R",5,5,5,5,5,100,"Y",100,"Y",100,"Y",100,"Y",100,"Y"]
[19,"1SG15EC020","BHOOMIKA J",5,5,5,5,5,100,"Y",100,"Y",100,"Y",100,"Y",100,"Y"]
[20,"1SG15EC021","BINDU B",5,5,5,5,5,100,"Y",100,"Y",100,"Y",100,"Y",100,"Y"]
[21,"1SG15EC022","BIPUL KUMAR",5,5,5,5,5,100,"Y",100,"Y",100,"Y",100,"Y",100,"Y"]
[22,"1SG15EC023","C S ADITH KIRAN",5,5,5,5,5,100,"Y",100,"Y",100,"Y",100,"Y",100,"Y"]
[23,"1SG15EC024","CHANDANA D L",5,5,5,5,5,100,"Y",100,"Y",100,"Y",100,"Y",100,"Y"]
[24,"1SG15EC025","CHANNA BASAVA",5,5,5,5,5,100,"Y",100,"Y",100,"Y",100,"Y",100,"Y"]
[25,"1SG15EC026","CHARITHA B M",5,5,5,5,5,100,"Y",100,"Y",100,"Y",100,"Y",100,"Y"]
[26,"1SG15EC027","CHIRAG S",5,5,5,5,5,100,"Y",100,"Y",100,"Y",100,"Y",100,"Y"]
[27,"1SG15EC028","CHITHRA K",5,5,5,5,5,100,"Y",100,"Y",100,"Y",100,"Y",100,"Y"]
[28,"1SG15EC029","DARSHAN C",5,5,5,5,5,100,"Y",100,"Y",100,"Y",100,"Y",100,"Y"]
[29,"1SG15EC030","DHARMKIRTI KUMAR",5,5,5,5,5,100,"Y",100,"Y",100,"Y",100,"Y",100,"Y"]
[30,"1SG15EC031","DILIP V",5,5,5,5,5,100,"Y",100,"Y",100,"Y",100,"Y",100,"Y"]
[31,"1SG15EC032","DIVYA B",5,5,5,5,5,100,"Y",100,"Y",100,"Y",100,"Y",100,"Y"]
[32,"1SG15EC033","DIVYA R",5,5,5,5,5,100,"Y",100,"Y",100,"Y",100,"Y",100,"Y"]
[33,"1SG15EC034","GEETHA M",5,5,5,5,5,100,"Y",100,"Y",100,"Y",100,"Y",100,"Y"]
[34,"1SG15EC035","GIRISH S",5,5,5,5,5,100,"Y",100,"Y",100,"Y",100,"Y",100,"Y"]
[35,"1SG15EC036","GOUTHAM M",5,5,5,5,5,100,"Y",100,"Y",100,"Y",100,"Y",100,"Y"]
[36,"1SG15EC037","HARISH C",5,5,5,5,5,100,"Y",100,"Y",100,"Y",100,"Y",100,"Y"]
[37,"1SG15EC038","HARSHA K B",5,5,5,5,5,100,"Y",100,"Y",100,"Y",100,"Y",100,"Y"]
[38,"1SG15EC039","HARSHITHA L",5,5,5,5,5,100,"Y",100,"Y",100,"Y",100,"Y",100,"Y"]
[39,null,"HIMANSHU SHEKHAR",5,5,5,5,5,100,"Y",100,"Y",100,"Y",100,"Y",100,"Y"]
[40,"1SG15EC041","HIMANSHU TIWARI",5,5,5,5,5,100,"Y",100,"Y",100,"Y",100,"Y",100,"Y"]
[41,"1SG15EC042","K AKSHAYA",5,5,5,5,5,100,"Y",100,"Y",100,"Y",100,"Y",100,"Y"]
[42,"1SG15EC043","KANAKA LAKSHMI A",5,5,5,5,5,100,"Y",100,"Y",100,"Y",100,"Y",100,"Y"]
[43,"1SG15EC044","KANNIKA HEGDE",5,5,5,5,5,100,"Y",100,"Y",100,"Y",100,"Y",100,"Y"]
[44,"1SG15EC045","KARTHIK K",5,5,5,5,5,100,"Y",100,"Y",100,"Y",100,"Y",100,"Y"]
[45,"1SG15EC046","KAVYASHREE G S",5,5,5,5,5,100,"Y",100,"Y",100,"Y",100,"Y",100,"Y"]
[46,"1SG15EC047","KIRAN R",5,5,5,5,5,100,"Y",100,"Y",100,"Y",100,"Y",100,"Y"]
[47,"1SG15EC048","KOSLENDER SINGH",5,5,5,5,5,100,"Y",100,"Y",100,"Y",100,"Y",100,"Y"]
[48,"1SG15EC049","KOTHOJU SRIDHAR CHARY",5,5,5,5,5,100,"Y",100,"Y",100,"Y",100,"Y",100,"Y"]
[48,"1SG15EC050","KOUSALYA S",5,5,5,5,5,100,"Y",100,"Y",100,"Y",100,"Y",100,"Y"]
[49,"1SG15EC051","KOUSHALYA D",5,5,5,5,5,100,"Y",100,"Y",100,"Y",100,"Y",100,"Y"]
[50,"1SG15EC052","KUMARI NEHA",5,5,5,5,5,100,"Y",100,"Y",100,"Y",100,"Y",100,"Y"]
[51,"1SG15EC053","LAVANYA M L",5,5,5,5,5,100,"Y",100,"Y",100,"Y",100,"Y",100,"Y"]
[52,"1SG15EC054","LINGARAJU L",5,5,5,5,5,100,"Y",100,"Y",100,"Y",100,"Y",100,"Y"]
[53,"1SG15EC056","MANJUNATHA NAIK N",5,5,5,5,5,100,"Y",100,"Y",100,"Y",100,"Y",100,"Y"]
[54,"1SG15EC057","MANOJ G",5,5,5,5,5,100,"Y",100,"Y",100,"Y",100,"Y",100,"Y"]
[55,"1SG15EC058","MANU RAJ SINGH",5,5,5,5,5,100,"Y",100,"Y",100,"Y",100,"Y",100,"Y"]
[56,"1SG15EC059","MEGHANA A S",5,5,5,5,5,100,"Y",100,"Y",100,"Y",100,"Y",100,"Y"]
[57,"1SG15EC060","MOHAMMED SHAHID",5,5,5,5,5,100,"Y",100,"Y",100,"Y",100,"Y",100,"Y"]
[58,"1SG15EC061","MOHAN VARMA K",5,5,5,5,5,100,"Y",100,"Y",100,"Y",100,"Y",100,"Y"]
[59,"1SG15EC062","MOHIT SHARMA",5,5,5,5,5,100,"Y",100,"Y",100,"Y",100,"Y",100,"Y"]
[null,"1SG15EC063","MOTILAL",5,5,5,5,5,100,"Y",100,"Y",100,"Y",100,"Y",100,"Y"]
[60,"1SG15EC064","NAYANA H J",5,5,5,5,5,100,"Y",100,"Y",100,"Y",100,"Y",100,"Y"]
[61,"1SG15EC065","NEHA S",5,5,5,5,5,100,"Y",100,"Y",100,"Y",100,"Y",100,"Y"]
[62,"1SG15EC066","NIDA SULTHANA N",5,5,5,5,5,100,"Y",100,"Y",100,"Y",100,"Y",100,"Y"]
[63,"1SG15EC067","NIKHIL R A",5,5,5,5,5,100,"Y",100,"Y",100,"Y",100,"Y",100,"Y"]
[null,"1SG15EC069","NISHAL KUMAR TIWARI",5,5,5,5,5,{"$f":"D76/0.05","v":100},{"$f":"IF(I76<60,\"N\",\"Y\")","v":"Y"},{"$f":"F76/0.05","v":100},{"$f":"IF(K76<60,\"N\",\"Y\")","v":"Y"},{"$f":"H76/0.05","v":100},{"$f":"IF(M76<60,\"N\",\"Y\")","v":"Y"},{"$f":"(G76/0.05)","v":100},{"$f":"IF(O76<60,\"N\",\"Y\")","v":"Y"},{"$f":"(H76/0.05)","v":100},{"$f":"IF(Q76<60,\"N\",\"Y\")","v":"Y"}]
[64,"1SG15EC069","NISHANT KUMAR",5,5,5,5,5,100,"Y",100,"Y",100,"Y",100,"Y",100,"Y"]
[65,"1SG15EC070","NIVEDITHA M",5,5,5,5,5,100,"Y",100,"Y",100,"Y",100,"Y",100,"Y"]
[66,"1SG15EC071","NIVEDITHA S",5,5,5,5,5,100,"Y",100,"Y",100,"Y",100,"Y",100,"Y"]
[67,"1SG15EC072","PAVITHRA J",5,5,5,5,5,100,"Y",100,"Y",100,"Y",100,"Y",100,"Y"]
[68,"1SG15EC073","PAVITRA",5,5,5,5,5,100,"Y",100,"Y",100,"Y",100,"Y",100,"Y"]
[69,"1SG15EC074","POOJA R",5,5,5,5,5,100,"Y",100,"Y",100,"Y",100,"Y",100,"Y"]
[70,"1SG15EC075","POOJA S BHAT",5,5,5,5,5,100,"Y",100,"Y",100,"Y",100,"Y",100,"Y"]
[71,"1SG15EC076","PRAJWAL K",5,5,5,5,5,100,"Y",100,"Y",100,"Y",100,"Y",100,"Y"]
[72,"1SG15EC077","PRAJWAL S",5,5,5,5,5,100,"Y",100,"Y",100,"Y",100,"Y",100,"Y"]
[73,"1SG15EC078","PRASHANT RAJPUT",5,5,5,5,5,100,"Y",100,"Y",100,"Y",100,"Y",100,"Y"]
[74,"1SG15EC079","PRASHANT SRIVASTAVA",5,5,5,5,5,100,"Y",100,"Y",100,"Y",100,"Y",100,"Y"]
[75,"1SG15EC080","PRATEEK KUMAR THAKUR",5,5,5,5,5,100,"Y",100,"Y",100,"Y",100,"Y",100,"Y"]
[76,"1SG15EC081","PRATHIBHA K",5,5,5,5,5,100,"Y",100,"Y",100,"Y",100,"Y",100,"Y"]
[77,"1SG15EC082","PREMA K S",5,5,5,5,5,100,"Y",100,"Y",100,"Y",100,"Y",100,"Y"]
[78,"1SG15EC083","PRIYADARSHINI C",5,5,5,5,5,100,"Y",100,"Y",100,"Y",100,"Y",100,"Y"]
[79,"1SG15EC084","PRUTHVI R",5,5,5,5,5,100,"Y",100,"Y",100,"Y",100,"Y",100,"Y"]
[80,"1SG15EC085","R REKHA",5,5,5,5,5,100,"Y",100,"Y",100,"Y",100,"Y",100,"Y"]
[81,"1SG15EC086","RAJ KUMAR",5,5,5,5,5,100,"Y",100,"Y",100,"Y",100,"Y",100,"Y"]
[82,"1SG15EC087","RAKSHA G R",5,5,5,5,5,100,"Y",100,"Y",100,"Y",100,"Y",100,"Y"]
[83,"1SG15EC088","RANJAN S",5,5,5,5,5,100,"Y",100,"Y",100,"Y",100,"Y",100,"Y"]
[84,"1SG15EC089","RANJITH GOWDA B",5,5,5,5,5,100,"Y",100,"Y",100,"Y",100,"Y",100,"Y"]
[85,"1SG15EC090","RAVI C",5,5,5,5,5,100,"Y",100,"Y",100,"Y",100,"Y",100,"Y"]
[86,"1SG15EC091","SAI SIDDHARTH M",5,5,5,5,5,100,"Y",100,"Y",100,"Y",100,"Y",100,"Y"]
[87,"1SG15EC092","SANDHYA V",5,5,5,5,5,100,"Y",100,"Y",100,"Y",100,"Y",100,"Y"]
[88,"1SG15EC093","SANDHYA Y G",5,5,5,5,5,100,"Y",100,"Y",100,"Y",100,"Y",100,"Y"]
[89,"1SG15EC094","SANJANA A S",5,5,5,5,5,100,"Y",100,"Y",100,"Y",100,"Y",100,"Y"]
[90,"1SG15EC095","SANJAY KUMAR B N",5,5,5,5,5,100,"Y",100,"Y",100,"Y",100,"Y",100,"Y"]
[null,"1SG15EC096","SANJAY KUMAR L",5,5,5,5,5,100,"Y",100,"Y",100,"Y",100,"Y",100,"Y"]
[91,"1SG15EC098","SHASHANK H S",5,5,5,5,5,100,"Y",100,"Y",100,"Y",100,"Y",100,"Y"]
[92,"1SG15EC099","SHASHANK SHEKHAR",5,5,5,5,5,100,"Y",100,"Y",100,"Y",100,"Y",100,"Y"]
[93,"1SG15EC100","SHASHIKANT KUMAR",5,5,5,5,5,100,"Y",100,"Y",100,"Y",100,"Y",100,"Y"]
[94,"1SG15EC101","SHRISH JHA",5,5,5,5,5,100,"Y",100,"Y",100,"Y",100,"Y",100,"Y"]
[95,"1SG15EC102","SHUBHAM KUMAR",5,5,5,5,5,100,"Y",100,"Y",100,"Y",100,"Y",100,"Y"]
[96,"1SG15EC103","SHUBHAM KUMAR(D)",5,5,5,5,5,100,"Y",100,"Y",100,"Y",100,"Y",100,"Y"]
[97,"1SG15EC104","SHUBHAM KUMAR MISHRA",5,5,5,5,5,100,"Y",100,"Y",100,"Y",100,"Y",100,"Y"]
[98,"1SG15EC105","SMITHA B BIRADAR",5,5,5,5,5,100,"Y",100,"Y",100,"Y",100,"Y",100,"Y"]
[null,"1SG15EC106","SONAM KUMARI",5,5,5,5,5,100,"Y",100,"Y",100,"Y",100,"Y",100,"Y"]
[99,"1SG15EC107","SUBHAM SHEKHAR PANDEY",5,5,5,5,5,100,"Y",100,"Y",100,"Y",100,"Y",100,"Y"]
[100,"1SG15EC108","SUKANYA KRISHNA POOJARI",5,5,5,5,5,100,"Y",100,"Y",100,"Y",100,"Y",100,"Y"]
[null,"1SG15EC109","SUMAIYA  I",5,5,5,5,5,100,"Y",100,"Y",100,"Y",100,"Y",100,"Y"]
[101,"1SG15EC110","SUMALATHA N",5,5,5,5,5,100,"Y",100,"Y",100,"Y",100,"Y",100,"Y"]
[102,"1SG15EC111","USHA KIRAN S",5,5,5,5,5,100,"Y",100,"Y",100,"Y",100,"Y",100,"Y"]
[103,"1SG15EC112","VAISHNAVI R SHETTY",5,5,5,5,5,100,"Y",100,"Y",100,"Y",100,"Y",100,"Y"]
[104,"1SG15EC113","VARSHINI N(D)",5,5,5,5,5,100,"Y",100,"Y",100,"Y",100,"Y",100,"Y"]
[105,"1SG15EC114","VEERESH M",5,5,5,5,5,100,"Y",100,"Y",100,"Y",100,"Y",100,"Y"]
[106,"1SG15EC115","VIKAS KASHYAP",5,5,5,5,5,100,"Y",100,"Y",100,"Y",100,"Y",100,"Y"]
[107,"1SG15EC116","VINAYAKA L S",5,5,5,5,5,100,"Y",100,"Y",100,"Y",100,"Y",100,"Y"]
[null,"1SG13EC131","RAMYA SK JADAV",5,5,5,5,5,100,"Y",100,"Y",100,"Y",100,"Y",100,"Y"]
[{"$nulls":9},{"$f":"COUNTIF(J11:J124,\"y\")","v":114},null,{"$f":"COUNTIF(L11:L124,\"y\")","v":114},null,{"$f":"COUNTIF(N11:N124,\"y\")","v":114},null,{"$f":"COUNTIF(P11:P124,\"y\")","v":114},null,{"$f":"COUNTIF(R11:R124,\"y\")","v":114}]

{"sheet":"final exam","index":5,"n_rows":125,"n_cols":18,"rows_kept":125,"merged":[[0,1,0,11],[1,1,1,11],[2,2,2,10],[3,1,3,11],[4,0,7,0],[4,1,7,1],[4,2,7,2],[4,3,5,7],[4,8,6,17],[7,8,7,9],[7,10,7,11],[7,12,7,13],[7,14,7,15],[7,16,7,17],[8,12,8,13],[8,14,8,15],[8,16,8,17]]}
[null,"Sapthagiri College of Engineering"]
[null,"Department of Electronics and Communication Engineering"]
[null,null,"Basic Electronics (15ELN15)"]
[null,"II Semester Test marks for EVEN Sem 2015-16 (G and H sections)"]
["Sl. No.","USN","NAME","Final exam",{"$nulls":4},"Course Objectives"]
[]
[]
[{"$nulls":3},"CO 1","CO2","CO3","CO4","C","CO1",null,"CO2",null,"CO3",null,"CO 4",null,"C0 5"]
[null,null,"MAX MARKS",5,5,5,5,5]
[{"$nulls":8},"%",null,"%",null,"%",null,"%",null,"%"]
[1,"1SG15EC001","ABHIJITH N",85,{"$f":"D11","v":85},{"$f":"D11","v":85},{"$f":"D11","v":85},{"$f":"D11","v":85},{"$f":"D11/1","v":85},{"$f":"IF(I11<60,\"N\",\"Y\")","v":"Y"},{"$f":"F11/1","v":85},{"$f":"IF(K11<60,\"N\",\"Y\")","v":"Y"},{"$f":"H11/1","v":85},{"$f":"IF(M11<60,\"N\",\"Y\")","v":"Y"},{"$f":"I11","v":85},{"$f":"IF(O11<60,\"N\",\"Y\")","v":"Y"},{"$f":"I11","v":85},{"$f":"IF(Q11<60,\"N\",\"Y\")","v":"Y"}]
[2,"1SG15EC002","ABHISHEK K",35,{"$f":"D12","v":35},{"$f":"D12","v":35},{"$f":"D12","v":35},{"$f":"D12","v":35},{"$f":"D12/1","v":35},{"$f":"IF(I12<60,\"N\",\"Y\")","v":"N"},{"$f":"F12/1","v":35},{"$f":"IF(K12<60,\"N\",\"Y\")","v":"N"},{"$f":"H12/1","v":35},{"$f":"IF(M12<60,\"N\",\"Y\")","v":"N"},{"$f":"I12","v":35},{"$f":"IF(O12<60,\"N\",\"Y\")","v":"N"},{"$f":"I12","v":35},{"$f":"IF(Q12<60,\"N\",\"Y\")","v":"N"}]
[3,"1SG15EC003","ABHISHEK N",45,45,45,45,45,45,"N",45,"N",45,"N",45,"N",45,"N"]
[4,"1SG15EC004","ADITYA P THAKKER",45,45,45,45,45,45,"N",45,"N",45,"N",45,"N",45,"N"]
[5,"1SG15EC006","AISHWARYA G",85,85,85,85,85,85,"Y",85,"Y",85,"Y",85,"Y",85,"Y"]
[6,"1SG15EC007","AKHIL SINGH",35,35,35,35,35,35,"N",35,"N",35,"N",35,"N",35,"N"]
[7,"1SG15EC008","ANJALI V JAKATI",85,85,85,85,85,85,"Y",85,"Y",85,"Y",85,"Y",85,"Y"]
[8,"1SG15EC009","ANJAN O",75,75,75,75,75,75,"Y",75,"Y",75,"Y",75,"Y",75,"Y"]
[9,"1SG15EC010","ANKIT PRIYAM",35,35,35,35,35,35,"N",35,"N",35,"N",35,"N",35,"N"]
[10,"1SG15EC011","ANKIT SHIVHARE",75,75,75,75,75,75,"Y",75,"Y",75,"Y",75,"Y",75,"Y"]
[11,"1SG15EC012","ANN NILEENA HENRY C",85,85,85,85,85,85,"Y",85,"Y",85,"Y",85,"Y",85,"Y"]
[12,"1SG15EC013","ANU PRIYE",55,55,55,55,55,55,"N",55,"N",55,"N",55,"N",55,"N"]
[13,"1SG15EC014","APOORVA G A",45,45,45,45,45,45,"N",45,"N",45,"N",45,"N",45,"N"]
[14,"1SG15EC015","ARCHANA B S",55,55,55,55,55,55,"N",55,"N",55,"N",55,"N",55,"N"]
[15,"1SG15EC016","ASHWANI GUPTA",35,35,35,35,35,35,"N",35,"N",35,"N",35,"N",35,"N"]
[16,"1SG15EC017","ASHWIN V",35,35,35,35,35,35,"N",35,"N",35,"N",35,"N",35,"N"]
[17,"1SG15EC018","B NIKHILESHWAR REDDY",45,45,45,45,45,45,"N",45,"N",45,"N",45,"N",45,"N"]
[18,"1SG15EC019","BHAVYA R",45,45,45,45,45,45,"N",45,"N",45,"N",45,"N",45,"N"]
[19,"1SG15EC020","BHOOMIKA J",75,75,75,75,75,75,"Y",75,"Y",75,"Y",75,"Y",75,"Y"]
[20,"1SG15EC021","BINDU B",65,65,65,65,65,65,"Y",65,"Y",65,"Y",65,"Y",65,"Y"]
[21,"1SG15EC022","BIPUL KUMAR",55,55,55,55,55,55,"N",55,"N",55,"N",55,"N",55,"N"]
[22,"1SG15EC023","C S ADITH KIRAN",95,95,95,95,95,95,"Y",95,"Y",95,"Y",95,"Y",95,"Y"]
[23,"1SG15EC024","CHANDANA D L",85,85,85,85,85,85,"Y",85,"Y",85,"Y",85,"Y",85,"Y"]
[24,"1SG15EC025","CHANNA BASAVA",75,75,75,75,75,75,"Y",75,"Y",75,"Y",75,"Y",75,"Y"]
[25,"1SG15EC026","CHARITHA B M",55,55,55,55,55,55,"N",55,"N",55,"N",55,"N",55,"N"]
[26,"1SG15EC027","CHIRAG S",75,75,75,75,75,75,"Y",75,"Y",75,"Y",75,"Y",75,"Y"]
[27,"1SG15EC028","CHITHRA K",85,85,85,85,85,85,"Y",85,"Y",85,"Y",85,"Y",85,"Y"]
[28,"1SG15EC029","DARSHAN C",35,35,35,35,35,35,"N",35,"N",35,"N",35,"N",35,"N"]
[29,"1SG15EC030","DHARMKIRTI KUMAR",45,45,45,45,45,45,"N",45,"N",45,"N",45,"N",45,"N"]
[30,"1SG15EC031","DILIP V",35,35,35,35,35,35,"N",35,"N",35,"N",35,"N",35,"N"]
[31,"1SG15EC032","DIVYA B",75,75,75,75,75,75,"Y",75,"Y",75,"Y",75,"Y",75,"Y"]
[32,"1SG15EC033","DIVYA R",85,85,85,85,85,85,"Y",85,"Y",85,"Y",85,"Y",85,"Y"]
[33,"1SG15EC034","GEETHA M",45,45,45,45,45,45,"N",45,"N",45,"N",45,"N",45,"N"]
[34,"1SG15EC035","GIRISH S",75,75,75,75,75,75,"Y",75,"Y",75,"Y",75,"Y",75,"Y"]
[35,"1SG15EC036","GOUTHAM M",65,65,65,65,65,65,"Y",65,"Y",65,"Y",65,"Y",65,"Y"]
[36,"1SG15EC037","HARISH C",95,95,95,95,95,95,"Y",95,"Y",95,"Y",95,"Y",95,"Y"]
[37,"1SG15EC038","HARSHA K B",95,95,95,95,95,95,"Y",95,"Y",95,"Y",95,"Y",95,"Y"]
[38,"1SG15EC039","HARSHITHA L",75,75,75,75,75,75,"Y",75,"Y",75,"Y",75,"Y",75,"Y"]
[39,null,"HIMANSHU SHEKHAR",55,55,55,55,55,55,"N",55,"N",55,"N",55,"N",55,"N"]
[40,"1SG15EC041","HIMANSHU TIWARI",75,75,75,75,75,75,"Y",75,"Y",75,"Y",75,"Y",75,"Y"]
[41,"1SG15EC042","K AKSHAYA",75,75,75,75,75,75,"Y",75,"Y",75,"Y",75,"Y",75,"Y"]
[42,"1SG15EC043","KANAKA LAKSHMI A",35,35,35,35,35,35,"N",35,"N",35,"N",35,"N",35,"N"]
[43,"1SG15EC044","KANNIKA HEGDE",85,85,85,85,85,85,"Y",85,"Y",85,"Y",85,"Y",85,"Y"]
[44,"1SG15EC045","KARTHIK K",75,75,75,75,75,75,"Y",75,"Y",75,"Y",75,"Y",75,"Y"]
[45,"1SG15EC046","KAVYASHREE G S",85,85,85,85,85,85,"Y",85,"Y",85,"Y",85,"Y",85,"Y"]
[46,"1SG15EC047","KIRAN R",85,85,85,85,85,85,"Y",85,"Y",85,"Y",85,"Y",85,"Y"]
[47,"1SG15EC048","KOSLENDER SINGH",85,85,85,85,85,85,"Y",85,"Y",85,"Y",85,"Y",85,"Y"]
[48,"1SG15EC049","KOTHOJU SRIDHAR CHARY",35,35,35,35,35,35,"N",35,"N",35,"N",35,"N",35,"N"]
[49,"1SG15EC050","KOUSALYA S",35,35,35,35,35,35,"N",35,"N",35,"N",35,"N",35,"N"]
[50,"1SG15EC051","KOUSHALYA D",85,85,85,85,85,85,"Y",85,"Y",85,"Y",85,"Y",85,"Y"]
[51,"1SG15EC052","KUMARI NEHA",75,75,75,75,75,75,"Y",75,"Y",75,"Y",75,"Y",75,"Y"]
[52,"1SG15EC053","LAVANYA M L",85,85,85,85,85,85,"Y",85,"Y",85,"Y",85,"Y",85,"Y"]
[53,"1SG15EC054","LINGARAJU L",85,85,85,85,85,85,"Y",85,"Y",85,"Y",85,"Y",85,"Y"]
[54,"1SG15EC056","MANJUNATHA NAIK N",35,35,35,35,35,35,"N",35,"N",35,"N",35,"N",35,"N"]
[55,"1SG15EC057","MANOJ G",85,85,85,85,85,85,"Y",85,"Y",85,"Y",85,"Y",85,"Y"]
[56,"1SG15EC058","MANU RAJ SINGH",45,45,45,45,45,45,"N",45,"N",45,"N",45,"N",45,"N"]
[57,"1SG15EC059","MEGHANA A S",95,95,95,95,95,95,"Y",95,"Y",95,"Y",95,"Y",95,"Y"]
[58,"1SG15EC060","MOHAMMED SHAHID",55,55,55,55,55,55,"N",55,"N",55,"N",55,"N",55,"N"]
[59,"1SG15EC061","MOHAN VARMA K",65,65,65,65,65,65,"Y",65,"Y",65,"Y",65,"Y",65,"Y"]
[60,"1SG15EC062","MOHIT SHARMA",85,85,85,85,85,85,"Y",85,"Y",85,"Y",85,"Y",85,"Y"]
[61,"1SG15EC063","MOTILAL",45,45,45,45,45,45,"N",45,"N",45,"N",45,"N",45,"N"]
[62,"1SG15EC064","NAYANA H J",95,95,95,95,95,95,"Y",95,"Y",95,"Y",95,"Y",95,"Y"]
[63,"1SG15EC065","NEHA S",95,95,95,95,95,95,"Y",95,"Y",95,"Y",95,"Y",95,"Y"]
[64,"1SG15EC066","NIDA SULTHANA N",95,95,95,95,95,95,"Y",95,"Y",95,"Y",95,"Y",95,"Y"]
[65,"1SG15EC067","NIKHIL R A",65,65,65,65,65,65,"Y",65,"Y",65,"Y",65,"Y",65,"Y"]
[66,"1SG15EC069","NISHAL KUMAR TIWARI",35,{"$f":"D76","v":35},{"$f":"D76","v":35},{"$f":"D76","v":35},{"$f":"D76","v":35},{"$f":"D76/1","v":35},{"$f":"IF(I76<60,\"N\",\"Y\")","v":"N"},{"$f":"F76/1","v":35},{"$f":"IF(K76<60,\"N\",\"Y\")","v":"N"},{"$f":"H76/1","v":35},{"$f":"IF(M76<60,\"N\",\"Y\")","v":"N"},{"$f":"I76","v":35},{"$f":"IF(O76<60,\"N\",\"Y\")","v":"N"},{"$f":"I76","v":35},{"$f":"IF(Q76<60,\"N\",\"Y\")","v":"N"}]
[67,"1SG15EC069","NISHANT KUMAR",75,75,75,75,75,75,"Y",75,"Y",75,"Y",75,"Y",75,"Y"]
[68,"1SG15EC070","NIVEDITHA M",95,95,95,95,95,95,"Y",95,"Y",95,"Y",95,"Y",95,"Y"]
[69,"1SG15EC071","NIVEDITHA S",35,35,35,35,35,35,"N",35,"N",35,"N",35,"N",35,"N"]
[70,"1SG15EC072","PAVITHRA J",95,95,95,95,95,95,"Y",95,"Y",95,"Y",95,"Y",95,"Y"]
[71,"1SG15EC073","PAVITRA",75,75,75,75,75,75,"Y",75,"Y",75,"Y",75,"Y",75,"Y"]
[72,"1SG15EC074","POOJA R",65,65,65,65,65,65,"Y",65,"Y",65,"Y",65,"Y",65,"Y"]
[73,"1SG15EC075","POOJA S BHAT",95,95,95,95,95,95,"Y",95,"Y",95,"Y",95,"Y",95,"Y"]
[74,"1SG15EC076","PRAJWAL K",65,65,65,65,65,65,"Y",65,"Y",65,"Y",65,"Y",65,"Y"]
[75,"1SG15EC077","PRAJWAL S",45,45,45,45,45,45,"N",45,"N",45,"N",45,"N",45,"N"]
[76,"1SG15EC078","PRASHANT RAJPUT",65,65,65,65,65,65,"Y",65,"Y",65,"Y",65,"Y",65,"Y"]
[77,"1SG15EC079","PRASHANT SRIVASTAVA",75,75,75,75,75,75,"Y",75,"Y",75,"Y",75,"Y",75,"Y"]
[78,"1SG15EC080","PRATEEK KUMAR THAKUR",95,95,95,95,95,95,"Y",95,"Y",95,"Y",95,"Y",95,"Y"]
[79,"1SG15EC081","PRATHIBHA K",75,75,75,75,75,75,"Y",75,"Y",75,"Y",75,"Y",75,"Y"]
[80,"1SG15EC082","PREMA K S",55,55,55,55,55,55,"N",55,"N",55,"N",55,"N",55,"N"]
[81,"1SG15EC083","PRIYADARSHINI C",65,65,65,65,65,65,"Y",65,"Y",65,"Y",65,"Y",65,"Y"]
[82,"1SG15EC084","PRUTHVI R",75,75,75,75,75,75,"Y",75,"Y",75,"Y",75,"Y",75,"Y"]
[83,"1SG15EC085","R REKHA",95,95,95,95,95,95,"Y",95,"Y",95,"Y",95,"Y",95,"Y"]
[84,"1SG15EC086","RAJ KUMAR",95,95,95,95,95,95,"Y",95,"Y",95,"Y",95,"Y",95,"Y"]
[85,"1SG15EC087","RAKSHA G R",95,95,95,95,95,95,"Y",95,"Y",95,"Y",95,"Y",95,"Y"]
[86,"1SG15EC088","RANJAN S",65,65,65,65,65,65,"Y",65,"Y",65,"Y",65,"Y",65,"Y"]
[87,"1SG15EC089","RANJITH GOWDA B",75,75,75,75,75,75,"Y",75,"Y",75,"Y",75,"Y",75,"Y"]
[88,"1SG15EC090","RAVI C",65,65,65,65,65,65,"Y",65,"Y",65,"Y",65,"Y",65,"Y"]
[89,"1SG15EC091","SAI SIDDHARTH M",45,45,45,45,45,45,"N",45,"N",45,"N",45,"N",45,"N"]
[90,"1SG15EC092","SANDHYA V",55,55,55,55,55,55,"N",55,"N",55,"N",55,"N",55,"N"]
[91,"1SG15EC093","SANDHYA Y G",75,75,75,75,75,75,"Y",75,"Y",75,"Y",75,"Y",75,"Y"]
[92,"1SG15EC094","SANJANA A S",85,85,85,85,85,85,"Y",85,"Y",85,"Y",85,"Y",85,"Y"]
[93,"1SG15EC095","SANJAY KUMAR B N",45,45,45,45,45,45,"N",45,"N",45,"N",45,"N",45,"N"]
[94,"1SG15EC096","SANJAY KUMAR L",35,35,35,35,35,35,"N",35,"N",35,"N",35,"N",35,"N"]
[95,"1SG15EC098","SHASHANK H S",45,45,45,45,45,45,"N",45,"N",45,"N",45,"N",45,"N"]
[96,"1SG15EC099","SHASHANK SHEKHAR",65,65,65,65,65,65,"Y",65,"Y",65,"Y",65,"Y",65,"Y"]
[97,"1SG15EC100","SHASHIKANT KUMAR",45,45,45,45,45,45,"N",45,"N",45,"N",45,"N",45,"N"]
[98,"1SG15EC101","SHRISH JHA",35,35,35,35,35,35,"N",35,"N",35,"N",35,"N",35,"N"]
[99,"1SG15EC102","SHUBHAM KUMAR",75,75,75,75,75,75,"Y",75,"Y",75,"Y",75,"Y",75,"Y"]
[100,"1SG15EC103","SHUBHAM KUMAR(D)",35,35,35,35,35,35,"N",35,"N",35,"N",35,"N",35,"N"]
[101,"1SG15EC104","SHUBHAM KUMAR MISHRA",85,85,85,85,85,85,"Y",85,"Y",85,"Y",85,"Y",85,"Y"]
[102,"1SG15EC105","SMITHA B BIRADAR",45,45,45,45,45,45,"N",45,"N",45,"N",45,"N",45,"N"]
[103,"1SG15EC106","SONAM KUMARI",35,35,35,35,35,35,"N",35,"N",35,"N",35,"N",35,"N"]
[104,"1SG15EC107","SUBHAM SHEKHAR PANDEY",75,75,75,75,75,75,"Y",75,"Y",75,"Y",75,"Y",75,"Y"]
[105,"1SG15EC108","SUKANYA KRISHNA POOJARI",85,85,85,85,85,85,"Y",85,"Y",85,"Y",85,"Y",85,"Y"]
[106,"1SG15EC109","SUMAIYA  I",35,35,35,35,35,35,"N",35,"N",35,"N",35,"N",35,"N"]
[107,"1SG15EC110","SUMALATHA N",45,45,45,45,45,45,"N",45,"N",45,"N",45,"N",45,"N"]
[108,"1SG15EC111","USHA KIRAN S",55,55,55,55,55,55,"N",55,"N",55,"N",55,"N",55,"N"]
[109,"1SG15EC112","VAISHNAVI R SHETTY",45,45,45,45,45,45,"N",45,"N",45,"N",45,"N",45,"N"]
[110,"1SG15EC113","VARSHINI N(D)",35,35,35,35,35,35,"N",35,"N",35,"N",35,"N",35,"N"]
[111,"1SG15EC114","VEERESH M",65,65,65,65,65,65,"Y",65,"Y",65,"Y",65,"Y",65,"Y"]
[112,"1SG15EC115","VIKAS KASHYAP",85,85,85,85,85,85,"Y",85,"Y",85,"Y",85,"Y",85,"Y"]
[113,"1SG15EC116","VINAYAKA L S",55,55,55,55,55,55,"N",55,"N",55,"N",55,"N",55,"N"]
[114,"1SG13EC131","RAMYA SK JADAV",55,55,55,55,55,55,"N",55,"N",55,"N",55,"N",55,"N"]
[{"$nulls":9},{"$f":"COUNTIF(J11:J124,\"y\")","v":67},null,{"$f":"COUNTIF(L11:L124,\"y\")","v":67},null,{"$f":"COUNTIF(N11:N124,\"y\")","v":67},null,{"$f":"COUNTIF(P11:P124,\"y\")","v":67},null,{"$f":"COUNTIF(R11:R124,\"y\")","v":67}]

{"sheet":"Total CO","index":6,"n_rows":14,"n_cols":7,"rows_kept":14,"merged":[[2,1,2,5]]}
[]
[null,null,"50% Weightage each for CIE and SEE"]
[null,"TARGET: 70% ATTAINMENT"]
[]
[]
[null,null,"CO1","CO2","CO3","CO4","CO5"]
[null,"IA MARKS ATTAINMENT",68,68,82,47,47]
[null,"Assignment ATTAINMENT",100,100,100,100,100]
[null,"CIE: AVG OF TEST & ASSIGNMENT",{"$f":"(C7+C8)/2","v":84},{"$f":"(D7+D8)/2","v":84},{"$f":"(E7+E8)/2","v":91},{"$f":"(F7+F8)/2","v":73.5},{"$f":"(G7+G8)/2","v":73.5}]
[]
[]
[null,"CIE",84,84,91,73.5,73.5]
[null,"SEE",67,67,67,67,67]
[null," Attainment",{"$f":"(C12+C13)/2","v":75.5},{"$f":"(D12+D13)/2","v":75.5},{"$f":"(E12+E13)/2","v":79},{"$f":"(F12+F13)/2","v":70.25},{"$f":"(G12+G13)/2","v":70.25}]

{"sheet":"Sheet4","index":7,"n_rows":65,"n_cols":19,"rows_kept":65,"merged":[[0,0,0,13],[1,0,1,13],[2,0,2,13],[5,4,5,10],[6,4,6,12],[9,3,9,12],[11,1,11,18],[12,1,12,18],[13,1,13,18],[14,1,15,1],[14,3,14,14],[14,15,14,18],[23,1,23,18],[24,1,24,18],[25,1,25,18],[26,1,27,1],[26,2,27,2],[26,3,26,14],[26,15,26,16],[37,1,59,18],[61,1,61,18],[62,1,62,18],[63,1,63,18],[64,1,64,18],[68,1,68,18],[69,2,69,19]]}
["SAPTHAGIRI COLLEGE OF ENGINEERING, BENGALURU - 57."]
["DEPARTMENT OF ELECTRONICS AND COMMUNICATION ENGINEERING"]
[" CO-PO ATTAINMENT (EVEN SEM. 2017-18)"]
["SEM & SEC: II  F",{"$nulls":4},"Subject: Basic Electronics",{"$nulls":7},"Subject Code: 17ELN25"]
["NAME OF THE FACULTY :RAVI SHANKARA M N"]
[{"$nulls":4},"II PO Attainment"]
[{"$nulls":4},"Subject teacher+ Class teacher= Program coordinator"]
[{"$nulls":4},"A: Direct assessment (80%)- Through CO-PO Mapping (By subject teacher)"]
[{"$nulls":4},"B: Indirect assessment (20%)-Exit survey (By class teacher)+Course end survey by subject teacher"]
[{"$nulls":3},"A: Direct assessment (80%)- Through CO-PO Mapping (By subject teacher)"]
[]
[null,"Mapping of Course outcomes (COs) and Program Ooutcomes (POs)"]
[null,"Note:  1 = Slight   2 = Moderate    3 = Strong"]
[]
[null,"Course outcomes",null,"Program Outcomes",{"$nulls":11},"PSO"]
[{"$nulls":3},"PO1","PO2","PO3","PO4","PO5","PO6","PO7","PO8","PO9","PO10","PO11","PO12","POS1","POS2","POS3","POS4"]
[null,"CO-1",null,3,3,2,{"$nulls":6},2,null,3,2,2,"NA","NA"]
[null,"CO-2",null,3,3,2,{"$nulls":6},2,null,3,2,2,"NA","NA"]
[null,"CO-3",null,3,3,2,{"$nulls":6},2,null,3,2,2,"NA","NA"]
[null,"CO - 4",null,3,3,3,{"$nulls":6},2,null,3,2,2,"NA","NA"]
[null,"CO-5",null,3,3,3,{"$nulls":6},2,null,3,2,2,"NA","NA"]
[null,"Average",null,{"$f":"(D17+D18+D19+D21+D20)/5","v":3},{"$f":"(E17+E18+E19+E21+E20)/5","v":3},{"$f":"(F17+F18+F19+F21+F20)/5","v":2.4},{"$nulls":6},{"$f":"(M17+M18+M19+M21+M20)/5","v":2},null,{"$f":"(O17+O18+O19+O21+O20)/5","v":3},{"$f":"(P17+P18+P19+P21+P20)/5","v":2},2]
[]
[null,"Mapping of Course outcomes (COs) and Program Ooutcomes (POs)"]
[null,"Note:  1 = Slight   2 = Moderate    3 = Strong      "]
[]
[null,"Course outcomes",null,"Program Outcomes",{"$nulls":11},"PSO"]
[{"$nulls":3},"PO1","PO2","PO3","PO4","PO5","PO6","PO7","PO8","PO9","PO10","PO11","PO12","POS1","POS2","POS3","POS4"]
[null,"CO-1",75.5,{"$f":"(C29/3)*D17","v":{"v":75.5,"d":"76"}},{"$f":"(D29/3)*E17","v":{"v":75.5,"d":"76"}},{"$f":"(C29/3)*F17","v":{"v":50.333333333333336,"d":"50"}},{"$nulls":6},{"$f":"(C29/3)*M17","v":{"v":50.333333333333336,"d":"50"}},null,{"$f":"(C29/3)*O17","v":{"v":75.5,"d":"76"}},{"$f":"(C29/3)*P17","v":50.333333333333336},{"$f":"(D29/3)*Q17","v":50.333333333333336},"NA","NA"]
[null,"CO-2",75.5,{"$f":"(C30/3)*D18","v":{"v":75.5,"d":"76"}},{"v":75.5,"d":"76"},{"$f":"(C30/3)*F18","v":{"v":50.333333333333336,"d":"50"}},{"$nulls":6},{"$f":"(C30/3)*M18","v":{"v":50.333333333333336,"d":"50"}},null,{"$f":"(C30/3)*O18","v":{"v":75.5,"d":"76"}},{"$f":"(C30/3)*P18","v":50.333333333333336},50.333333333333336,"NA","NA"]
[null,"CO-3",79,79,79,{"v":52.666666666666664,"d":"53"},{"$nulls":6},{"v":52.666666666666664,"d":"53"},null,79,52.666666666666664,52.666666666666664,"NA","NA"]
[null,"CO-4",70.5,{"v":70.5,"d":"71"},{"v":70.5,"d":"71"},{"v":70.5,"d":"71"},{"$nulls":6},47,null,{"v":70.5,"d":"71"},47,47,"NA","NA"]
[null,"CO-5",70.5,{"v":70.5,"d":"71"},{"v":70.5,"d":"71"},{"v":70.5,"d":"71"},{"$nulls":6},47,null,{"v":70.5,"d":"71"},47,47,"NA","NA"]
[null,"Average",{"$f":"(C29+C30+C31+C33+C32)/5","v":74.2},{"v":74.2,"d":"74"},{"v":74.2,"d":"74"},{"v":59.36,"d":"59"},{"$nulls":6},{"v":49.46666666666667,"d":"49"},null,{"v":74.2,"d":"74"},49.46666666666667,{"$f":"(Q29+Q30+Q31+Q33+Q32)/5","v":49.46666666666667}]
[]
[]
[]
[null,"Engineering Graduates will be able to:\n\n1. Engineering Knowledge: Apply the knowledge of mathematics, science, engineering fundamentals, and an engineering specialization to the solution of complex engineering problems.\n2. Problems Analysis: Identify, formulate, review research literature, and analyze complex, engineering problems reaching sustained conclusions using first principles of mathematics, natural science and engineering science.\n3. Design/development of solutions: Design solutions for complex engineering problems and design system   components of process that meet the specified needs with appropriate consideration for the public health and safety, and cultural, societal, and environmental consideration.\n4. Conduct investigations of complex problems: Use research-based knowledge and research methods including design of experiments analysis and interpretation of data, and synthesis of information to provide valid conclusions.\n5. Modern tool usage: create, select, and apply appropriate techniques, resource and modern engineering and IT tools including prediction and modeling to complex engineering activities with an understanding of the limitations.\n6. The engineer and society: Apply the reasoning informed by the contextual knowledge to access societal, health, safety, legal and cultural issue and the consequent responsibility relevant to the professional engineering practice.\n7. Environment and sustainability: Understanding the impact of the professional engineering solution in the social and environmental contexts, and demonstrate the knowledge of, and need for sustainable development.\n8. Ethics: Apply ethics principle and commit to professional ethic and responsibility and norms of the engineering practice.\n9. Individual and team work: Function effectively as an individual, and as member or leader in diverse team, and in multidisciplinary setting.\n10. Communication: Communicate effectively on complex engineering activities with the engineering community and with society at large, such as, being to comprehend and write effective reports and design documentation, make effective presentations, and give and receive clear instructions.\n11. Project management and finance: Demonstrate knowledge and understanding of the engineering and management principles and apply these to one’s own work, as a member and leader in team, to manage projects and in multidisciplinary environments.\n12. Life-long learning: Recognizing the need for, and have the preparation and ability to engage in independent and life-long learning in the broadest context of technological change.\n\n"]
{"$rows_empty":23}
[null,"CO1 : "]
[null,"CO2: "]
[null,"CO3:  "]
[null,"CO4: "]